{"text_format":"1","workbook":"xlsx","n_sheets":3,"sheets":["Kurzanleitung","Kennzeichen-Liste","Data (do not change!)"],"not_rendered":{"charts":0,"images":2,"macros":1,"external_links":0,"defined_names":0,"comments":0,"pivot_tables":0},"unopened":[],"bounds":{"document_bytes":16777216,"sheet_cells":100000,"rows_first":2000,"rows_last":500,"rows_between":2000,"halvings":0,"cell_chars":16384,"cell_head_chars":4096},"cells_cut":0,"cells_raw":0,"read":"whole","date_system":"1900"}

{"sheet":"Kurzanleitung","index":0,"n_rows":26,"n_cols":7,"rows_kept":26,"cut":false,"hidden":false,"merged":[[7,1,7,9],[25,1,25,9],[9,3,9,6]]}
[]
[null,null,"Bitte ausfüllen:"]
[null,"Organisation","Ihre Organisation"]
[null,"Ersteller:","Ihr Name"]
[]
[]
[null,"Kurzanleitung:"]
[null,"Hinweise: Grundsätzlich sind alle Felder, die nicht auszufüllen sind, gesperrt. Maximal können 10.000 Kennzeichen-Zeilen eingegeben werden. Zur Verwendung müssen Makros bzw. Code-Ausführung in Excel aktiviert sein.\n\n1. Auf dem zweiten Tabellenblatt \"Kennzeichen-Liste\" können die Kennzeichen, Nationalität, Fahrzeugtyp, Organisation sowie Beginn und Ende der Ausnahme eingegeben werden. Die Spalte \"No\" wird automatisch befüllt und kann nicht eingegeben werden. Alle Felder sind Pflichtfelder.\nErlaubte Zeichen für Kennzeichen sind Buchstaben, Zahlen sowie als Platzhalter der Bindestrich [-] für Wappen oder Plaketten auf deutschen und österreichischen Kennzeichen bzw. ein Stern [*] für alle Kennzeichen einer Organisation (also z.B. BP-*).\nWichtig: In der Spalte Nationalität können nur Einträge, die in der Drop-Down Liste vorhanden sind, eingegeben werden. Dies ist bei einer Befüllung mit 'Copy & Paste' zu beachten. Die möglichen Werte für diese Spalte sind: "]
[]
[null,null,null,"Nationalität"]
[null,null,null,"Österreich","Bulgarien","Luxemburg","Serbien"]
[null,null,null,"Deutschland","Dänemark","Malta","Spanien"]
[null,null,null,"Schweiz","Estland","Mazedonien","Türkei"]
[null,null,null,"Italien","Finnland","Moldawien","Ukraine"]
[null,null,null,"Slowakei","Frankreich","Monaco","Weißrussland"]
[null,null,null,"Tschechische Republik","Griechenland","Montenegro","Zypern"]
[null,null,null,"Slowenien","Großbritannien","Norwegen","Kosovo"]
[null,null,null,"Ungarn","Irland","Polen","Sonstige Länder"]
[null,null,null,"Niederlande","Island","Portugal"]
[null,null,null,"Albanien","Kroatien","Rumänien"]
[null,null,null,"Andorra","Lettland","Russland"]
[null,null,null,"Belgien","Liechtenstein","San Marino"]
[null,null,null,"Bosnien und Herzegowina","Litauen","Schweden"]
[]
[]
[null,"Diese Werte sind exakt so einzugeben, sollte eine Befüllung mit 'Copy & Paste' erfolgen. In der Spalte Weight Class muss entweder \"größer 3,5 t hzG\" oder bis \"einschließlich 3,5t hzG\" ausgewählt werden.  \n\n2. Anschließend muss dann über den Button \"Export der Liste\" auf dem Tabellenblatt \"Kennzeichen-Liste\" die Kennzeichen-Datei generiert werden. Diese Datei befindet sich nach der Erstellung im gleichen Verzeichnis, in dem diese Excel-Datei abgelegt wurde."]

{"sheet":"Kennzeichen-Liste","index":1,"n_rows":1000,"n_cols":8,"rows_kept":1000,"cut":false,"hidden":false,"merged":[]}
["No","Nationality","Nationality","License Plate","Weight Class","Valid from","Valid to","Organisation"]
[1,null,{"$f":"IFERROR(VLOOKUP(B2,'Data (do not change!)'!$A$2:$B$48,2,FALSE),\"\")","v":""}]
[{"$f":"IF(B3<>\"\",A2+1,\"\")","v":""},null,{"$f":"IFERROR(VLOOKUP(B3,'Data (do not change!)'!$A$2:$B$48,2,FALSE),\"\")","v":""}]
[{"$f":"IF(B4<>\"\",A3+1,\"\")","v":""},null,{"$f":"IFERROR(VLOOKUP(B4,'Data (do not change!)'!$A$2:$B$48,2,FALSE),\"\")","v":""}]
[{"$f":"IF(B5<>\"\",A4+1,\"\")","v":""},null,{"$f":"IFERROR(VLOOKUP(B5,'Data (do not change!)'!$A$2:$B$48,2,FALSE),\"\")","v":""}]
["",null,{"$f":"IFERROR(VLOOKUP(B6,'Data (do not change!)'!$A$2:$B$48,2,FALSE),\"\")","v":""}]
["",null,{"$f":"IFERROR(VLOOKUP(B7,'Data (do not change!)'!$A$2:$B$48,2,FALSE),\"\")","v":""}]
["",null,{"$f":"IFERROR(VLOOKUP(B8,'Data (do not change!)'!$A$2:$B$48,2,FALSE),\"\")","v":""}]
["",null,{"$f":"IFERROR(VLOOKUP(B9,'Data (do not change!)'!$A$2:$B$48,2,FALSE),\"\")","v":""}]
["",null,{"$f":"IFERROR(VLOOKUP(B10,'Data (do not change!)'!$A$2:$B$48,2,FALSE),\"\")","v":""}]
["",null,{"$f":"IFERROR(VLOOKUP(B11,'Data (do not change!)'!$A$2:$B$48,2,FALSE),\"\")","v":""}]
["",null,{"$f":"IFERROR(VLOOKUP(B12,'Data (do not change!)'!$A$2:$B$48,2,FALSE),\"\")","v":""}]
["",null,{"$f":"IFERROR(VLOOKUP(B13,'Data (do not change!)'!$A$2:$B$48,2,FALSE),\"\")","v":""}]
["",null,{"$f":"IFERROR(VLOOKUP(B14,'Data (do not change!)'!$A$2:$B$48,2,FALSE),\"\")","v":""}]
["",null,{"$f":"IFERROR(VLOOKUP(B15,'Data (do not change!)'!$A$2:$B$48,2,FALSE),\"\")","v":""}]
["",null,{"$f":"IFERROR(VLOOKUP(B16,'Data (do not change!)'!$A$2:$B$48,2,FALSE),\"\")","v":""}]
["",null,{"$f":"IFERROR(VLOOKUP(B17,'Data (do not change!)'!$A$2:$B$48,2,FALSE),\"\")","v":""}]
["",null,{"$f":"IFERROR(VLOOKUP(B18,'Data (do not change!)'!$A$2:$B$48,2,FALSE),\"\")","v":""}]
["",null,{"$f":"IFERROR(VLOOKUP(B19,'Data (do not change!)'!$A$2:$B$48,2,FALSE),\"\")","v":""}]
["",null,{"$f":"IFERROR(VLOOKUP(B20,'Data (do not change!)'!$A$2:$B$48,2,FALSE),\"\")","v":""}]
["",null,{"$f":"IFERROR(VLOOKUP(B21,'Data (do not change!)'!$A$2:$B$48,2,FALSE),\"\")","v":""}]
["",null,{"$f":"IFERROR(VLOOKUP(B22,'Data (do not change!)'!$A$2:$B$48,2,FALSE),\"\")","v":""}]
["",null,{"$f":"IFERROR(VLOOKUP(B23,'Data (do not change!)'!$A$2:$B$48,2,FALSE),\"\")","v":""}]
["",null,{"$f":"IFERROR(VLOOKUP(B24,'Data (do not change!)'!$A$2:$B$48,2,FALSE),\"\")","v":""}]
["",null,{"$f":"IFERROR(VLOOKUP(B25,'Data (do not change!)'!$A$2:$B$48,2,FALSE),\"\")","v":""}]
["",null,{"$f":"IFERROR(VLOOKUP(B26,'Data (do not change!)'!$A$2:$B$48,2,FALSE),\"\")","v":""}]
["",null,{"$f":"IFERROR(VLOOKUP(B27,'Data (do not change!)'!$A$2:$B$48,2,FALSE),\"\")","v":""}]
["",null,{"$f":"IFERROR(VLOOKUP(B28,'Data (do not change!)'!$A$2:$B$48,2,FALSE),\"\")","v":""}]
["",null,{"$f":"IFERROR(VLOOKUP(B29,'Data (do not change!)'!$A$2:$B$48,2,FALSE),\"\")","v":""}]
["",null,{"$f":"IFERROR(VLOOKUP(B30,'Data (do not change!)'!$A$2:$B$48,2,FALSE),\"\")","v":""}]
["",null,{"$f":"IFERROR(VLOOKUP(B31,'Data (do not change!)'!$A$2:$B$48,2,FALSE),\"\")","v":""}]
["",null,{"$f":"IFERROR(VLOOKUP(B32,'Data (do not change!)'!$A$2:$B$48,2,FALSE),\"\")","v":""}]
["",null,{"$f":"IFERROR(VLOOKUP(B33,'Data (do not change!)'!$A$2:$B$48,2,FALSE),\"\")","v":""}]
["",null,{"$f":"IFERROR(VLOOKUP(B34,'Data (do not change!)'!$A$2:$B$48,2,FALSE),\"\")","v":""}]
["",null,{"$f":"IFERROR(VLOOKUP(B35,'Data (do not change!)'!$A$2:$B$48,2,FALSE),\"\")","v":""}]
["",null,{"$f":"IFERROR(VLOOKUP(B36,'Data (do not change!)'!$A$2:$B$48,2,FALSE),\"\")","v":""}]
["",null,{"$f":"IFERROR(VLOOKUP(B37,'Data (do not change!)'!$A$2:$B$48,2,FALSE),\"\")","v":""}]
["",null,{"$f":"IFERROR(VLOOKUP(B38,'Data (do not change!)'!$A$2:$B$48,2,FALSE),\"\")","v":""}]
["",null,{"$f":"IFERROR(VLOOKUP(B39,'Data (do not change!)'!$A$2:$B$48,2,FALSE),\"\")","v":""}]
["",null,{"$f":"IFERROR(VLOOKUP(B40,'Data (do not change!)'!$A$2:$B$48,2,FALSE),\"\")","v":""}]
["",null,{"$f":"IFERROR(VLOOKUP(B41,'Data (do not change!)'!$A$2:$B$48,2,FALSE),\"\")","v":""}]
["",null,{"$f":"IFERROR(VLOOKUP(B42,'Data (do not change!)'!$A$2:$B$48,2,FALSE),\"\")","v":""}]
["",null,{"$f":"IFERROR(VLOOKUP(B43,'Data (do not change!)'!$A$2:$B$48,2,FALSE),\"\")","v":""}]
["",null,{"$f":"IFERROR(VLOOKUP(B44,'Data (do not change!)'!$A$2:$B$48,2,FALSE),\"\")","v":""}]
["",null,{"$f":"IFERROR(VLOOKUP(B45,'Data (do not change!)'!$A$2:$B$48,2,FALSE),\"\")","v":""}]
["",null,{"$f":"IFERROR(VLOOKUP(B46,'Data (do not change!)'!$A$2:$B$48,2,FALSE),\"\")","v":""}]
["",null,{"$f":"IFERROR(VLOOKUP(B47,'Data (do not change!)'!$A$2:$B$48,2,FALSE),\"\")","v":""}]
["",null,{"$f":"IFERROR(VLOOKUP(B48,'Data (do not change!)'!$A$2:$B$48,2,FALSE),\"\")","v":""}]
["",null,{"$f":"IFERROR(VLOOKUP(B49,'Data (do not change!)'!$A$2:$B$48,2,FALSE),\"\")","v":""}]
["",null,{"$f":"IFERROR(VLOOKUP(B50,'Data (do not change!)'!$A$2:$B$48,2,FALSE),\"\")","v":""}]
["",null,{"$f":"IFERROR(VLOOKUP(B51,'Data (do not change!)'!$A$2:$B$48,2,FALSE),\"\")","v":""}]
["",null,{"$f":"IFERROR(VLOOKUP(B52,'Data (do not change!)'!$A$2:$B$48,2,FALSE),\"\")","v":""}]
["",null,{"$f":"IFERROR(VLOOKUP(B53,'Data (do not change!)'!$A$2:$B$48,2,FALSE),\"\")","v":""}]
["",null,{"$f":"IFERROR(VLOOKUP(B54,'Data (do not change!)'!$A$2:$B$48,2,FALSE),\"\")","v":""}]
["",null,{"$f":"IFERROR(VLOOKUP(B55,'Data (do not change!)'!$A$2:$B$48,2,FALSE),\"\")","v":""}]
["",null,{"$f":"IFERROR(VLOOKUP(B56,'Data (do not change!)'!$A$2:$B$48,2,FALSE),\"\")","v":""}]
["",null,{"$f":"IFERROR(VLOOKUP(B57,'Data (do not change!)'!$A$2:$B$48,2,FALSE),\"\")","v":""}]
["",null,{"$f":"IFERROR(VLOOKUP(B58,'Data (do not change!)'!$A$2:$B$48,2,FALSE),\"\")","v":""}]
["",null,{"$f":"IFERROR(VLOOKUP(B59,'Data (do not change!)'!$A$2:$B$48,2,FALSE),\"\")","v":""}]
["",null,{"$f":"IFERROR(VLOOKUP(B60,'Data (do not change!)'!$A$2:$B$48,2,FALSE),\"\")","v":""}]
["",null,{"$f":"IFERROR(VLOOKUP(B61,'Data (do not change!)'!$A$2:$B$48,2,FALSE),\"\")","v":""}]
["",null,{"$f":"IFERROR(VLOOKUP(B62,'Data (do not change!)'!$A$2:$B$48,2,FALSE),\"\")","v":""}]
["",null,{"$f":"IFERROR(VLOOKUP(B63,'Data (do not change!)'!$A$2:$B$48,2,FALSE),\"\")","v":""}]
["",null,{"$f":"IFERROR(VLOOKUP(B64,'Data (do not change!)'!$A$2:$B$48,2,FALSE),\"\")","v":""}]
["",null,{"$f":"IFERROR(VLOOKUP(B65,'Data (do not change!)'!$A$2:$B$48,2,FALSE),\"\")","v":""}]
["",null,{"$f":"IFERROR(VLOOKUP(B66,'Data (do not change!)'!$A$2:$B$48,2,FALSE),\"\")","v":""}]
["",null,{"$f":"IFERROR(VLOOKUP(B67,'Data (do not change!)'!$A$2:$B$48,2,FALSE),\"\")","v":""}]
[{"$f":"IF(B68<>\"\",A67+1,\"\")","v":""},null,{"$f":"IFERROR(VLOOKUP(B68,'Data (do not change!)'!$A$2:$B$48,2,FALSE),\"\")","v":""}]
["",null,{"$f":"IFERROR(VLOOKUP(B69,'Data (do not change!)'!$A$2:$B$48,2,FALSE),\"\")","v":""}]
["",null,{"$f":"IFERROR(VLOOKUP(B70,'Data (do not change!)'!$A$2:$B$48,2,FALSE),\"\")","v":""}]
["",null,{"$f":"IFERROR(VLOOKUP(B71,'Data (do not change!)'!$A$2:$B$48,2,FALSE),\"\")","v":""}]
["",null,{"$f":"IFERROR(VLOOKUP(B72,'Data (do not change!)'!$A$2:$B$48,2,FALSE),\"\")","v":""}]
["",null,{"$f":"IFERROR(VLOOKUP(B73,'Data (do not change!)'!$A$2:$B$48,2,FALSE),\"\")","v":""}]
["",null,{"$f":"IFERROR(VLOOKUP(B74,'Data (do not change!)'!$A$2:$B$48,2,FALSE),\"\")","v":""}]
["",null,{"$f":"IFERROR(VLOOKUP(B75,'Data (do not change!)'!$A$2:$B$48,2,FALSE),\"\")","v":""}]
["",null,{"$f":"IFERROR(VLOOKUP(B76,'Data (do not change!)'!$A$2:$B$48,2,FALSE),\"\")","v":""}]
["",null,{"$f":"IFERROR(VLOOKUP(B77,'Data (do not change!)'!$A$2:$B$48,2,FALSE),\"\")","v":""}]
["",null,{"$f":"IFERROR(VLOOKUP(B78,'Data (do not change!)'!$A$2:$B$48,2,FALSE),\"\")","v":""}]
["",null,{"$f":"IFERROR(VLOOKUP(B79,'Data (do not change!)'!$A$2:$B$48,2,FALSE),\"\")","v":""}]
["",null,{"$f":"IFERROR(VLOOKUP(B80,'Data (do not change!)'!$A$2:$B$48,2,FALSE),\"\")","v":""}]
["",null,{"$f":"IFERROR(VLOOKUP(B81,'Data (do not change!)'!$A$2:$B$48,2,FALSE),\"\")","v":""}]
["",null,{"$f":"IFERROR(VLOOKUP(B82,'Data (do not change!)'!$A$2:$B$48,2,FALSE),\"\")","v":""}]
["",null,{"$f":"IFERROR(VLOOKUP(B83,'Data (do not change!)'!$A$2:$B$48,2,FALSE),\"\")","v":""}]
["",null,{"$f":"IFERROR(VLOOKUP(B84,'Data (do not change!)'!$A$2:$B$48,2,FALSE),\"\")","v":""}]
["",null,{"$f":"IFERROR(VLOOKUP(B85,'Data (do not change!)'!$A$2:$B$48,2,FALSE),\"\")","v":""}]
["",null,{"$f":"IFERROR(VLOOKUP(B86,'Data (do not change!)'!$A$2:$B$48,2,FALSE),\"\")","v":""}]
["",null,{"$f":"IFERROR(VLOOKUP(B87,'Data (do not change!)'!$A$2:$B$48,2,FALSE),\"\")","v":""}]
["",null,{"$f":"IFERROR(VLOOKUP(B88,'Data (do not change!)'!$A$2:$B$48,2,FALSE),\"\")","v":""}]
["",null,{"$f":"IFERROR(VLOOKUP(B89,'Data (do not change!)'!$A$2:$B$48,2,FALSE),\"\")","v":""}]
["",null,{"$f":"IFERROR(VLOOKUP(B90,'Data (do not change!)'!$A$2:$B$48,2,FALSE),\"\")","v":""}]
["",null,{"$f":"IFERROR(VLOOKUP(B91,'Data (do not change!)'!$A$2:$B$48,2,FALSE),\"\")","v":""}]
["",null,{"$f":"IFERROR(VLOOKUP(B92,'Data (do not change!)'!$A$2:$B$48,2,FALSE),\"\")","v":""}]
["",null,{"$f":"IFERROR(VLOOKUP(B93,'Data (do not change!)'!$A$2:$B$48,2,FALSE),\"\")","v":""}]
["",null,{"$f":"IFERROR(VLOOKUP(B94,'Data (do not change!)'!$A$2:$B$48,2,FALSE),\"\")","v":""}]
["",null,{"$f":"IFERROR(VLOOKUP(B95,'Data (do not change!)'!$A$2:$B$48,2,FALSE),\"\")","v":""}]
["",null,{"$f":"IFERROR(VLOOKUP(B96,'Data (do not change!)'!$A$2:$B$48,2,FALSE),\"\")","v":""}]
["",null,{"$f":"IFERROR(VLOOKUP(B97,'Data (do not change!)'!$A$2:$B$48,2,FALSE),\"\")","v":""}]
["",null,{"$f":"IFERROR(VLOOKUP(B98,'Data (do not change!)'!$A$2:$B$48,2,FALSE),\"\")","v":""}]
["",null,{"$f":"IFERROR(VLOOKUP(B99,'Data (do not change!)'!$A$2:$B$48,2,FALSE),\"\")","v":""}]
["",null,{"$f":"IFERROR(VLOOKUP(B100,'Data (do not change!)'!$A$2:$B$48,2,FALSE),\"\")","v":""}]
["",null,{"$f":"IFERROR(VLOOKUP(B101,'Data (do not change!)'!$A$2:$B$48,2,FALSE),\"\")","v":""}]
["",null,{"$f":"IFERROR(VLOOKUP(B102,'Data (do not change!)'!$A$2:$B$48,2,FALSE),\"\")","v":""}]
["",null,{"$f":"IFERROR(VLOOKUP(B103,'Data (do not change!)'!$A$2:$B$48,2,FALSE),\"\")","v":""}]
["",null,{"$f":"IFERROR(VLOOKUP(B104,'Data (do not change!)'!$A$2:$B$48,2,FALSE),\"\")","v":""}]
["",null,{"$f":"IFERROR(VLOOKUP(B105,'Data (do not change!)'!$A$2:$B$48,2,FALSE),\"\")","v":""}]
["",null,{"$f":"IFERROR(VLOOKUP(B106,'Data (do not change!)'!$A$2:$B$48,2,FALSE),\"\")","v":""}]
["",null,{"$f":"IFERROR(VLOOKUP(B107,'Data (do not change!)'!$A$2:$B$48,2,FALSE),\"\")","v":""}]
["",null,{"$f":"IFERROR(VLOOKUP(B108,'Data (do not change!)'!$A$2:$B$48,2,FALSE),\"\")","v":""}]
["",null,{"$f":"IFERROR(VLOOKUP(B109,'Data (do not change!)'!$A$2:$B$48,2,FALSE),\"\")","v":""}]
["",null,{"$f":"IFERROR(VLOOKUP(B110,'Data (do not change!)'!$A$2:$B$48,2,FALSE),\"\")","v":""}]
["",null,{"$f":"IFERROR(VLOOKUP(B111,'Data (do not change!)'!$A$2:$B$48,2,FALSE),\"\")","v":""}]
["",null,{"$f":"IFERROR(VLOOKUP(B112,'Data (do not change!)'!$A$2:$B$48,2,FALSE),\"\")","v":""}]
["",null,{"$f":"IFERROR(VLOOKUP(B113,'Data (do not change!)'!$A$2:$B$48,2,FALSE),\"\")","v":""}]
["",null,{"$f":"IFERROR(VLOOKUP(B114,'Data (do not change!)'!$A$2:$B$48,2,FALSE),\"\")","v":""}]
["",null,{"$f":"IFERROR(VLOOKUP(B115,'Data (do not change!)'!$A$2:$B$48,2,FALSE),\"\")","v":""}]
["",null,{"$f":"IFERROR(VLOOKUP(B116,'Data (do not change!)'!$A$2:$B$48,2,FALSE),\"\")","v":""}]
["",null,{"$f":"IFERROR(VLOOKUP(B117,'Data (do not change!)'!$A$2:$B$48,2,FALSE),\"\")","v":""}]
["",null,{"$f":"IFERROR(VLOOKUP(B118,'Data (do not change!)'!$A$2:$B$48,2,FALSE),\"\")","v":""}]
["",null,{"$f":"IFERROR(VLOOKUP(B119,'Data (do not change!)'!$A$2:$B$48,2,FALSE),\"\")","v":""}]
["",null,{"$f":"IFERROR(VLOOKUP(B120,'Data (do not change!)'!$A$2:$B$48,2,FALSE),\"\")","v":""}]
["",null,{"$f":"IFERROR(VLOOKUP(B121,'Data (do not change!)'!$A$2:$B$48,2,FALSE),\"\")","v":""}]
["",null,{"$f":"IFERROR(VLOOKUP(B122,'Data (do not change!)'!$A$2:$B$48,2,FALSE),\"\")","v":""}]
["",null,{"$f":"IFERROR(VLOOKUP(B123,'Data (do not change!)'!$A$2:$B$48,2,FALSE),\"\")","v":""}]
["",null,{"$f":"IFERROR(VLOOKUP(B124,'Data (do not change!)'!$A$2:$B$48,2,FALSE),\"\")","v":""}]
["",null,{"$f":"IFERROR(VLOOKUP(B125,'Data (do not change!)'!$A$2:$B$48,2,FALSE),\"\")","v":""}]
["",null,{"$f":"IFERROR(VLOOKUP(B126,'Data (do not change!)'!$A$2:$B$48,2,FALSE),\"\")","v":""}]
["",null,{"$f":"IFERROR(VLOOKUP(B127,'Data (do not change!)'!$A$2:$B$48,2,FALSE),\"\")","v":""}]
["",null,{"$f":"IFERROR(VLOOKUP(B128,'Data (do not change!)'!$A$2:$B$48,2,FALSE),\"\")","v":""}]
["",null,{"$f":"IFERROR(VLOOKUP(B129,'Data (do not change!)'!$A$2:$B$48,2,FALSE),\"\")","v":""}]
["",null,{"$f":"IFERROR(VLOOKUP(B130,'Data (do not change!)'!$A$2:$B$48,2,FALSE),\"\")","v":""}]
["",null,{"$f":"IFERROR(VLOOKUP(B131,'Data (do not change!)'!$A$2:$B$48,2,FALSE),\"\")","v":""}]
[{"$f":"IF(B132<>\"\",A131+1,\"\")","v":""},null,{"$f":"IFERROR(VLOOKUP(B132,'Data (do not change!)'!$A$2:$B$48,2,FALSE),\"\")","v":""}]
["",null,{"$f":"IFERROR(VLOOKUP(B133,'Data (do not change!)'!$A$2:$B$48,2,FALSE),\"\")","v":""}]
["",null,{"$f":"IFERROR(VLOOKUP(B134,'Data (do not change!)'!$A$2:$B$48,2,FALSE),\"\")","v":""}]
["",null,{"$f":"IFERROR(VLOOKUP(B135,'Data (do not change!)'!$A$2:$B$48,2,FALSE),\"\")","v":""}]
["",null,{"$f":"IFERROR(VLOOKUP(B136,'Data (do not change!)'!$A$2:$B$48,2,FALSE),\"\")","v":""}]
["",null,{"$f":"IFERROR(VLOOKUP(B137,'Data (do not change!)'!$A$2:$B$48,2,FALSE),\"\")","v":""}]
["",null,{"$f":"IFERROR(VLOOKUP(B138,'Data (do not change!)'!$A$2:$B$48,2,FALSE),\"\")","v":""}]
["",null,{"$f":"IFERROR(VLOOKUP(B139,'Data (do not change!)'!$A$2:$B$48,2,FALSE),\"\")","v":""}]
["",null,{"$f":"IFERROR(VLOOKUP(B140,'Data (do not change!)'!$A$2:$B$48,2,FALSE),\"\")","v":""}]
["",null,{"$f":"IFERROR(VLOOKUP(B141,'Data (do not change!)'!$A$2:$B$48,2,FALSE),\"\")","v":""}]
["",null,{"$f":"IFERROR(VLOOKUP(B142,'Data (do not change!)'!$A$2:$B$48,2,FALSE),\"\")","v":""}]
["",null,{"$f":"IFERROR(VLOOKUP(B143,'Data (do not change!)'!$A$2:$B$48,2,FALSE),\"\")","v":""}]
["",null,{"$f":"IFERROR(VLOOKUP(B144,'Data (do not change!)'!$A$2:$B$48,2,FALSE),\"\")","v":""}]
["",null,{"$f":"IFERROR(VLOOKUP(B145,'Data (do not change!)'!$A$2:$B$48,2,FALSE),\"\")","v":""}]
["",null,{"$f":"IFERROR(VLOOKUP(B146,'Data (do not change!)'!$A$2:$B$48,2,FALSE),\"\")","v":""}]
["",null,{"$f":"IFERROR(VLOOKUP(B147,'Data (do not change!)'!$A$2:$B$48,2,FALSE),\"\")","v":""}]
["",null,{"$f":"IFERROR(VLOOKUP(B148,'Data (do not change!)'!$A$2:$B$48,2,FALSE),\"\")","v":""}]
["",null,{"$f":"IFERROR(VLOOKUP(B149,'Data (do not change!)'!$A$2:$B$48,2,FALSE),\"\")","v":""}]
["",null,{"$f":"IFERROR(VLOOKUP(B150,'Data (do not change!)'!$A$2:$B$48,2,FALSE),\"\")","v":""}]
["",null,{"$f":"IFERROR(VLOOKUP(B151,'Data (do not change!)'!$A$2:$B$48,2,FALSE),\"\")","v":""}]
["",null,{"$f":"IFERROR(VLOOKUP(B152,'Data (do not change!)'!$A$2:$B$48,2,FALSE),\"\")","v":""}]
["",null,{"$f":"IFERROR(VLOOKUP(B153,'Data (do not change!)'!$A$2:$B$48,2,FALSE),\"\")","v":""}]
["",null,{"$f":"IFERROR(VLOOKUP(B154,'Data (do not change!)'!$A$2:$B$48,2,FALSE),\"\")","v":""}]
["",null,{"$f":"IFERROR(VLOOKUP(B155,'Data (do not change!)'!$A$2:$B$48,2,FALSE),\"\")","v":""}]
["",null,{"$f":"IFERROR(VLOOKUP(B156,'Data (do not change!)'!$A$2:$B$48,2,FALSE),\"\")","v":""}]
["",null,{"$f":"IFERROR(VLOOKUP(B157,'Data (do not change!)'!$A$2:$B$48,2,FALSE),\"\")","v":""}]
["",null,{"$f":"IFERROR(VLOOKUP(B158,'Data (do not change!)'!$A$2:$B$48,2,FALSE),\"\")","v":""}]
["",null,{"$f":"IFERROR(VLOOKUP(B159,'Data (do not change!)'!$A$2:$B$48,2,FALSE),\"\")","v":""}]
["",null,{"$f":"IFERROR(VLOOKUP(B160,'Data (do not change!)'!$A$2:$B$48,2,FALSE),\"\")","v":""}]
["",null,{"$f":"IFERROR(VLOOKUP(B161,'Data (do not change!)'!$A$2:$B$48,2,FALSE),\"\")","v":""}]
["",null,{"$f":"IFERROR(VLOOKUP(B162,'Data (do not change!)'!$A$2:$B$48,2,FALSE),\"\")","v":""}]
["",null,{"$f":"IFERROR(VLOOKUP(B163,'Data (do not change!)'!$A$2:$B$48,2,FALSE),\"\")","v":""}]
["",null,{"$f":"IFERROR(VLOOKUP(B164,'Data (do not change!)'!$A$2:$B$48,2,FALSE),\"\")","v":""}]
["",null,{"$f":"IFERROR(VLOOKUP(B165,'Data (do not change!)'!$A$2:$B$48,2,FALSE),\"\")","v":""}]
["",null,{"$f":"IFERROR(VLOOKUP(B166,'Data (do not change!)'!$A$2:$B$48,2,FALSE),\"\")","v":""}]
["",null,{"$f":"IFERROR(VLOOKUP(B167,'Data (do not change!)'!$A$2:$B$48,2,FALSE),\"\")","v":""}]
["",null,{"$f":"IFERROR(VLOOKUP(B168,'Data (do not change!)'!$A$2:$B$48,2,FALSE),\"\")","v":""}]
["",null,{"$f":"IFERROR(VLOOKUP(B169,'Data (do not change!)'!$A$2:$B$48,2,FALSE),\"\")","v":""}]
["",null,{"$f":"IFERROR(VLOOKUP(B170,'Data (do not change!)'!$A$2:$B$48,2,FALSE),\"\")","v":""}]
["",null,{"$f":"IFERROR(VLOOKUP(B171,'Data (do not change!)'!$A$2:$B$48,2,FALSE),\"\")","v":""}]
["",null,{"$f":"IFERROR(VLOOKUP(B172,'Data (do not change!)'!$A$2:$B$48,2,FALSE),\"\")","v":""}]
["",null,{"$f":"IFERROR(VLOOKUP(B173,'Data (do not change!)'!$A$2:$B$48,2,FALSE),\"\")","v":""}]
["",null,{"$f":"IFERROR(VLOOKUP(B174,'Data (do not change!)'!$A$2:$B$48,2,FALSE),\"\")","v":""}]
["",null,{"$f":"IFERROR(VLOOKUP(B175,'Data (do not change!)'!$A$2:$B$48,2,FALSE),\"\")","v":""}]
["",null,{"$f":"IFERROR(VLOOKUP(B176,'Data (do not change!)'!$A$2:$B$48,2,FALSE),\"\")","v":""}]
["",null,{"$f":"IFERROR(VLOOKUP(B177,'Data (do not change!)'!$A$2:$B$48,2,FALSE),\"\")","v":""}]
["",null,{"$f":"IFERROR(VLOOKUP(B178,'Data (do not change!)'!$A$2:$B$48,2,FALSE),\"\")","v":""}]
["",null,{"$f":"IFERROR(VLOOKUP(B179,'Data (do not change!)'!$A$2:$B$48,2,FALSE),\"\")","v":""}]
["",null,{"$f":"IFERROR(VLOOKUP(B180,'Data (do not change!)'!$A$2:$B$48,2,FALSE),\"\")","v":""}]
["",null,{"$f":"IFERROR(VLOOKUP(B181,'Data (do not change!)'!$A$2:$B$48,2,FALSE),\"\")","v":""}]
["",null,{"$f":"IFERROR(VLOOKUP(B182,'Data (do not change!)'!$A$2:$B$48,2,FALSE),\"\")","v":""}]
["",null,{"$f":"IFERROR(VLOOKUP(B183,'Data (do not change!)'!$A$2:$B$48,2,FALSE),\"\")","v":""}]
["",null,{"$f":"IFERROR(VLOOKUP(B184,'Data (do not change!)'!$A$2:$B$48,2,FALSE),\"\")","v":""}]
["",null,{"$f":"IFERROR(VLOOKUP(B185,'Data (do not change!)'!$A$2:$B$48,2,FALSE),\"\")","v":""}]
["",null,{"$f":"IFERROR(VLOOKUP(B186,'Data (do not change!)'!$A$2:$B$48,2,FALSE),\"\")","v":""}]
["",null,{"$f":"IFERROR(VLOOKUP(B187,'Data (do not change!)'!$A$2:$B$48,2,FALSE),\"\")","v":""}]
["",null,{"$f":"IFERROR(VLOOKUP(B188,'Data (do not change!)'!$A$2:$B$48,2,FALSE),\"\")","v":""}]
["",null,{"$f":"IFERROR(VLOOKUP(B189,'Data (do not change!)'!$A$2:$B$48,2,FALSE),\"\")","v":""}]
["",null,{"$f":"IFERROR(VLOOKUP(B190,'Data (do not change!)'!$A$2:$B$48,2,FALSE),\"\")","v":""}]
["",null,{"$f":"IFERROR(VLOOKUP(B191,'Data (do not change!)'!$A$2:$B$48,2,FALSE),\"\")","v":""}]
["",null,{"$f":"IFERROR(VLOOKUP(B192,'Data (do not change!)'!$A$2:$B$48,2,FALSE),\"\")","v":""}]
["",null,{"$f":"IFERROR(VLOOKUP(B193,'Data (do not change!)'!$A$2:$B$48,2,FALSE),\"\")","v":""}]
["",null,{"$f":"IFERROR(VLOOKUP(B194,'Data (do not change!)'!$A$2:$B$48,2,FALSE),\"\")","v":""}]
["",null,{"$f":"IFERROR(VLOOKUP(B195,'Data (do not change!)'!$A$2:$B$48,2,FALSE),\"\")","v":""}]
[{"$f":"IF(B196<>\"\",A195+1,\"\")","v":""},null,{"$f":"IFERROR(VLOOKUP(B196,'Data (do not change!)'!$A$2:$B$48,2,FALSE),\"\")","v":""}]
["",null,{"$f":"IFERROR(VLOOKUP(B197,'Data (do not change!)'!$A$2:$B$48,2,FALSE),\"\")","v":""}]
["",null,{"$f":"IFERROR(VLOOKUP(B198,'Data (do not change!)'!$A$2:$B$48,2,FALSE),\"\")","v":""}]
["",null,{"$f":"IFERROR(VLOOKUP(B199,'Data (do not change!)'!$A$2:$B$48,2,FALSE),\"\")","v":""}]
["",null,{"$f":"IFERROR(VLOOKUP(B200,'Data (do not change!)'!$A$2:$B$48,2,FALSE),\"\")","v":""}]
{"$rows_left_out":801}
{"sheet":"Data (do not change!)","index":2,"n_rows":48,"n_cols":5,"rows_kept":48,"cut":false,"hidden":true,"merged":[]}
["Nationality",null,"Product ID",null,"Weight Class"]
["Österreich","AT"]
["Deutschland","DE","Jahresvignette Pkw 2018","B18J","größer 3,5 t hzG"]
["Schweiz","CH","2-Monatsvignette Pkw 2018","B18M","bis einschl. 3,5 t hzG"]
["Italien","IT","10-Tagesvignette Pkw 2018","B18T"]
["Slowakei","SK","Jahreskarte A 13 Brenner",17]
["Tschechische Republik","CZ","Jahreskarte A 9 Pyhrn / Bosruck- und Gleinalmtunnel",22]
["Slowenien","SI","Jahreskarte A 10 Tauern Autobahn",18]
["Ungarn","HU","Jahreskarte S 16 Arlberg Straßentunnel",28]
["Niederlande","NL","10-Tagesvignette Motorrad 2018","A18T"]
["Albanien","AL","2-Monatsvignette Motorrad 2018","A18M"]
["Andorra","AD","Jahresvignette Motorrad 2018","A18J"]
["Belgien","BE"]
["Bosnien und Herzegowina","BA"]
["Bulgarien","BG"]
["Dänemark","DK"]
["Estland","EE"]
["Finnland","FI"]
["Frankreich","FR"]
["Griechenland","GR"]
["Großbritannien","GB"]
["Irland","IE"]
["Island","IS"]
["Kroatien","HR"]
["Lettland","LV"]
["Liechtenstein","LI"]
["Litauen","LT"]
["Luxemburg","LU"]
["Malta","MT"]
["Mazedonien","MK"]
["Moldawien","MD"]
["Monaco","MC"]
["Montenegro","ME"]
["Norwegen","NO"]
["Polen","PL"]
["Portugal","PT"]
["Rumänien","RO"]
["Russland","RU"]
["San Marino","SM"]
["Schweden","SE"]
["Serbien","RS"]
["Spanien","ES"]
["Türkei","TR"]
["Ukraine","UA"]
["Weißrussland","BY"]
["Zypern","CY"]
["Kosovo","XK"]
["Sonstige Länder","XX"]